启动进程时出现System.ComponentModel.Win32Exception-文件未找到,但文件存在
我正在尝试为我的AutoStart创建经理.它应该读取XML文件,然后以自定义延迟启动我的程序.例如: Realtek Audio Manager C:\Program Files\Realtek\Audio\HDA\RtkNGUI64.exe 5 这将在5秒后运行指定的过程(C:\Program Files\...\RtkNGUI64.exe -s). 现在,三个程序将无法启动,给了我一个System.ComponentModel.Win32Exception:" Das System Kann Die Angebene Datei Nicht Finden." ("系统无法找到指定的文件.") 但是XML正确解析,我要启动的文件位于XML文件中指定的位置.
2 2024-04-13
编程技术问答社区
C# windows应用程序事件。应用程序启动时的CLR20r3
我创建了一个C#应用程序,并将其安装在我的测试框上.我的应用在开发框上非常完美,但是当我安装在另一台机器上时,它会崩溃在主()中.我得到EventType:Clr20R3 这是事件消息 Problem signature: Problem Event Name: CLR20r3 Problem Signature 01: logfileviewer.exe Problem Signature 02: 1.0.0.0 Problem Signature 03: 4f356c9c Problem Signature 04: LogFileViewer Problem Signature 05: 1.0.0.0 Problem Signature 06: 4f356c9c Problem Signature 07: 94 Problem Signature 08: 44
8 2024-04-13
编程技术问答社区
为什么添加多处理可以防止Python找到我的编译C程序?
我目前正在寻求使用多处理的力量加快代码.但是,在调用Python调用编译代码时,我遇到了一些问题,因为在包含任何形式的多处理时,编译的文件似乎从代码的视图中消失了. 例如,使用以下测试代码: #include int main() { int thread_id; #pragma omp parallel { thread_id = omp_get_thread_num(); } return 0; } 在这里,我编译了程序,然后使用命令 将其转换为.so文件. gcc -fopenmp -o theories/test.so -shared -fPIC -O2 test.c 然后,我尝试从test.py运行上述代码: from ctypes import CDLL import os absolute_path = os.path.dirname(os.path.abspath(__fil
12 2024-04-08
编程技术问答社区
Visual Studio 2013 (vs120)要求提供错误的提升库
我正在尝试使用Visual Studio 2013在Windows 7上编译我的一个项目.我已经安装了Boost 1.53并使用CMAKE设置解决方案. 发生的事情是,现在编译的Boost库中的形式libboost_*-vc120-mt(-gd)-1_53.lib.在"链接器"项目选项中,在"输入"选项卡下,我验证了我需要的库,实际上编译器能够正确读取它们. 但是,由于某种原因,我绝对无法理解,链接器也试图找到编译为vc110的库.例如: error LNK1104: cannot open file 'libboost_filesystem-vc110-mt-gd-1_53.lib' 项目选项中列出的平台工具集是" Visual Studio 2013(V120)".在任何项目选项中,我都找不到对VC110的任何引用.你能帮我了解发生了什么吗? 解决方案 感谢这篇文章解决了我的问题.我以前找不到它.解决方案是编辑boost/config/auto_link
2 2024-04-02
编程技术问答社区
Javascript-保存到磁盘的文件被卡在Chrome的内存中
我有此代码: function saveFile(str, part) { var textFileAsBlob = new Blob([str], {type:"text/plain"}); var fileNameToSaveAs = "Parsed audio - part "+part; var downloadLink = document.createElement("a"); downloadLink.download = fileNameToSaveAs; downloadLink.innerHTML = "Download File"; if (window.URL != null) { // Chrome allows the link to be clicked // without actually adding it to the DOM. downloadLink.href = wind
2 2024-04-01
编程技术问答社区
抑制批处理文件中的 "未找到文件"。
我试图在BAT文件下运行,该文件为我提供了一个文件夹中存在的文件,我根据文件获得计数,但是如果没有文件,我将获得"未找到文件" 计数为0,哪个还可以,但是我想压制"找不到文件" 脚本: @echo off setlocal enabledelayedexpansion @echo off set c2=0 echo Folder,NoOfFiles for /f "tokens=*" %%x in ('dir /s /a /b "D:\Flow\Flow1\Flow2\Flow3\NGR*.txt"') do set /a c2+=1 echo.NGR,!c2! 结果: 文件夹,nooffiles 找不到文件 ngr,0 按任何键继续. . . 我试图使用2> nul,但这也不起作用 有人可以帮助我获得解决方案,在这里可以做什么? 解决方案 尝试: for /f "tokens=*" %%x in (
6 2024-03-29
编程技术问答社区
Wordpress中的Permalinks-找不到页面
我一直在搜索数小时,但没有找到任何能够解决此问题的东西. 这是场景: 我正在根据"二十十一"主题进行WP主题.一切顺利,直到我决定将URL更改为永久链接.显示的唯一页面是我之前定义的静态页面. 我已经设置了HTACCES文件.实际上,WP会自动进行.如果我切换回默认设置,一切都可以使用,但是,对于SEO,我宁愿使用永久链接选项. 这是我的htaccess文件(在我的WP安装文件夹上): # BEGIN WordPress RewriteEngine On RewriteBase /mysite/ RewriteRule ^index\.php$ - [L] RewriteCond %{REQUEST_FILENAME} !-f RewriteCond %{REQUEST_FILENAME} !-d RewriteRule . /mysite/index.php [L] # END W
10 2024-01-02
编程技术问答社区
外部框架文件。未找到h(Parse/Parse.h)文件
因此,每次我更新应用程序时,Xcode声称即使在那里也无法找到特定的外部框架. Xcode 6和我通常的方法又发生了(我经验不足,所以这些基本上涉及单击并键入事物,直到发生某些事情(我夸张但夸张,但没有太多))不起作用. > 我遇到了一个Lexical or Preprocessor Issue错误的错误,说'Parse/Parse.h' file not found.',但以下是项目中的屏幕截图,并添加到库中: 我还遵循了'ld'>'ld:警告:警告:未找到选项目录',但仍然没有. 知道该怎么办?有什么想法吗?我在这里撕开头​​发. 解决方案 实际上我面临着同样的问题,但是在做了很多(删除/添加分析框架)努力之后,我知道parse.Framework已经添加了,并且仍然存在错误. 真正的问题不是主要项目的链接二进制问题,而是与测试链接二进制相关的. 假设您的项目名称是" Project1",Xcode用它的" Project1 -Tests"创建了另一个文
12 2023-12-20
编程技术问答社区
没有找到头文件,但只适用于设备构建,不适用模拟器构建
当我将Xcode更新为7.1.1时,它开始显示以下消息:未找到特定的标头文件,但标题文件在那里. 当我为模拟器构建时,它不会显示此消息. 在模拟器作品中: 在设备中没有: 最尴尬的是,我创建一个单个视图,一无所有并在设备上运行. 消息显示: /Users/gabrielrodrigues/Desktop/puc-vc/PUC VC/PUC VC-Bridging-Header.h:9:9: error: 'MMDrawerController.h' file not found #import "MMDrawerController.h" ^ :0: error: failed to import bridging header '/Users/gabrielrodrigues/Desktop/puc-vc/PUC VC/PUC VC-Bridging-Header.h' 解决方案 我不需要再使用Bridging-heade
0 2023-12-18
编程技术问答社区
错误 "没有要加载的文件"-sqlite3/sqlite3_native (LoadError)
我的操作系统是Windows 7. 我的问题是,当我尝试运行rails server时,会发生错误.我已经安装了sqlite3宝石,甚至是sqlite-ruby gem,仍然没有. 我已经不知道该怎么办. 如果有人需要任何其他信息,请要求它. 完整的错误是: C:/Ruby192/lib/ruby/gems/1.9.1/gems/sqlite3-1.3.3-x86-mingw32/lib/sqlite3.rb:6:in `require': no such file to load -- sqlite3/sqlite3_native (LoadError) from C:/Ruby192/lib/ruby/gems/1.9.1/gems/sqlite3-1.3.3-x86-mingw32/lib/sqlite3.rb:6:in `rescue in ' from C:/Ruby192/lib/ruby/gems
10 2023-12-05
编程技术问答社区
Hosted Laravel 5.4 App显示 "View [path.to.viewfile] not found"。
我尝试在GoDaddy托管我的Laravel应用程序.登录后的主页以及日志ins和仪表板的运行良好.但是,其他视图返回fileviewfinder.php line 137中的invalidargumentException:"查看[path.to.viewfile]找不到. 我正在使用return view::make('path.to.viewfile') 从控制器返回视图 它使用XAMPP在我的Local主机上效果很好.有人知道如何解决此问题吗? 解决方案 您是否检查了文件名和许可?文件名在linux中对案例敏感(您的托管提供者使用它) 其他解决方案 您必须在服务器上更改目录权限. storage和bootstrap/cache目录中的目录和文件应写作(例如CHMOD 777)
8 2023-11-19
编程技术问答社区
VBA在关闭和重新打开excel后无法读取文件
假设我在同一文件夹中有3个文件(item.xlsx,master.xlsx,trass.xlsm)的主要目的是将数据从项目传输到主机. 我在Transfer.xlsm中执行所有代码,并允许用户输入文件名和列映射.我已经为代码做了几个小时,并且已经测试了几次,并且工作正常.单击按钮,按钮可以根据列映射读取item.xlsx的数据,然后将其复制到master.xlsx. 但是,当我关闭所有3个文件并再次重新打开时,出现问题.我打开所有3个文件,当我单击传输时的按钮时,XLSM显示了我所做的错误处理.我确实尝试过在桌面上创建一个新文件夹,并在内部创建一个全新的Transfer.xlsm,将项目和主文件和代码复制到新按钮中.它实际上可以工作,但是当我关闭并重新打开该新文件夹不起作用时, 我在处理它时基本上工作正常,当我完全关闭它并重新打开时,它无法检测到两个文件. 根据用户输入 , 在Transfer.xlsm中输入 source = Cells(5, 2) sou
20 2023-11-16
编程技术问答社区
在Xcode 4.5.1中,"未找到文件","链接器命令失败,退出代码1"。
正在开发现有的iOS应用程序,我必须为该项目编写单元测试用例.它正在模拟器6.0中构建和运行. 每当我尝试测试项目时,它都会显示下面的错误消息.无法弄清楚确切的错误. id: file not found: /Users/Yuva/Library/Developer/Xcode/DerivedData/FlyApp-aexukpgtbathuadgxlnm/Build/Products/Debug-iphonesimulator/FlyApp.app/FlyApp clag: error: linker command failed with exit code 1 (use -v to see invocation) 您能帮我解决此链接器错误并测试应用程序吗? 解决方案 解决的步骤: 创建不同名称的新方案 删除旧方案 添加新方案 问题来自以下位置: 我更改了我的产品名称,并禁用了快照选项.然后,突然间,此错误突然出现: ld: fi
18 2023-11-07
编程技术问答社区
错误。文件 "Info.plist "不能被打开,因为没有这样的文件。
我已经将项目从另一台机器中移动,其中安装了最新的Xcode.但是现在,当我运行项目时,它会给我带来错误 info.plist:0:错误:读取数据:文件" info.plist"不可能是 由于没有这样的文件而打开. 以前的项目运行没有任何问题,但是现在在新系统项目上有错误.以前的版本是Xcode 7.3. 解决方案 当系统无法从文件层次结构中找到info.plist文件时,此错误就会发生. 考虑以下情况:我将info.plist文件移到了类似的"其他". goto target-点击构建设置 - 查找" info.plist" 在这里,系统将在AddModifyDelete文件夹中搜索info.plist.但是实际的文件位于AddModifyDelete/其他下方.因此,将其更改为addModifyDelete/ersots/info.plist 现在它应该起作用! 注意:这也适用于权利文件.我们应该为这两个信息定义正确的路径. 其他解决
32 2023-10-08
编程技术问答社区
Python 子进程 FileNotFoundError
我正在尝试关注此博客关于如何从Python执行R脚本.我使用rscript从命令行中正常工作. 这是我的python代码: import subprocess import os command = "C:\Program Files\R\R-3.4.4\bin\Rscript" path2script = os.getcwd() + "\max.R" # gives me the absolute path to the R script args = ["11", "3", "9", "42"] cmd = [command, path2script] + args x = subprocess.check_output(cmd, universal_newlines = True) 给我这个错误: filenotfounderror:[WinError 2]系统找不到指定的文件 我已经阅读了很多有关此错误的文章,在大多数情况下,尝试调用系统命令喜欢d
16 2023-10-04
编程技术问答社区
在XAMMP/apache 2.2中使用htdocs下的子目录在localhost上打开一个HTML文件
我有一个用于HTML(Dreamweaver CSS3)的站点目录,其中包含许多下拉菜单的html文件的子目录.它们在哪里工作正常,但是它们都有JavaScript的菜单,并且可以将其保存在一个单独的文件中.因此,我想使用.我不想每次要测试其中的文件.我想在本地机器上放这个.因此,我是第一次尝试设置XAMMP,然后在Localhost上运行我的HTML文件(站点),因此我可以在将所有内容ft ft for for for to hostgator之前看到它们的样子. . 我尝试将主站点文件夹复制到HTDOC,然后将路径复制到我想在Firefox的Localhost前运行的文件,但它给了我文件:找不到: 000-Comingsoon/phptestcomingsoonnmbt-test.html 我有太多的子目录吗?为什么找不到文件?它在那里. 也尝试了一下: 不去. 解决方案 http://localhost/应该等于xampp/htdocs/(即,应访
14 2023-10-04
编程技术问答社区
pip install pygame-SDL.h 文件未找到
macos sierra ➜ fun_python $ pip --version pip 9.0.1 from /Library/Frameworks/Python.framework/Versions/3.5/lib/python3.5/site-packages (python 3.5) pip install pygame给我以下错误:src/scrap.c:27:10: fatal error: 'SDL.h' file not found,error: command '/usr/bin/clang' failed with exit status 1,#include "SDL.h".我看不到/usr/include/...文件夹树的SDL/SDL.H文件. 给了我以下错误. ➜ fun_python $ pip install pygame Collecting pygame Downloading pygame-1.9.3.tar.gz (
18 2023-08-23
编程技术问答社区
PyInstaller: 一个模块没有包含在-onefile中,但是在-onedir中工作正常。
我正在使用pyinstaller将我的应用程序捆绑到一个.exe文件中. 问题在于它可以与-onedir选项一起使用,但是使用-onefile构建时找不到模块. 两者都在建筑过程中说: INFO: Analyzing hidden import 'sklearn.utils.sparsetools._graph_validation' 运行使用-Onedir创建的实例工作正常,但是-Onefile产生的实例死亡: File "_min_spanning_tree.pyx", line 8, in init sklearn.utils.mst._min_spanning _tree (sklearn\utils\sparsetools\_min_spanning_tree.c:4754) ImportError: No module named _graph_validation 这是我的.spec文件 onedir.
14 2023-08-21
编程技术问答社区